id,sex,birth_year,country,region,group,infection_reason,infection_order,infected_by,contact_number,confirmed_date,released_date,deceased_date,state
1,female,1984,China,filtered at airport,,visit to Wuhan,1,,45,2020-01-20,2020-02-06,,released
2,male,1964,Korea,filtered at airport,,visit to Wuhan,1,,75,2020-01-24,2020-02-05,,released
3,male,1966,Korea,capital area,,visit to Wuhan,1,,16,2020-01-26,2020-02-12,,released
4,male,1964,Korea,capital area,,visit to Wuhan,1,,95,2020-01-27,2020-02-09,,released
5,male,1987,Korea,capital area,,visit to Wuhan,1,,31,2020-01-30,2020-03-02,,released
6,male,1964,Korea,capital area,,contact with patient,2,3,17,2020-01-30,2020-02-19,,released
7,male,1991,Korea,capital area,,visit to Wuhan,1,,9,2020-01-30,2020-02-15,,released
8,female,1957,Korea,Jeollabuk-do,,visit to Wuhan,1,,113,2020-01-31,2020-02-12,,released
9,female,1992,Korea,capital area,,contact with patient,2,5,2,2020-01-31,2020-02-24,,released
10,female,1966,Korea,capital area,,contact with patient,3,6,43,2020-01-31,2020-02-19,,released
11,male,1995,Korea,capital area,,contact with patient,3,6,0,2020-01-31,2020-02-10,,released
12,male,1971,China,capital area,,contact with patient in Japan,2,,422,2020-02-01,2020-02-18,,released
13,male,1992,Korea,filtered at airport,,residence in Wuhan,1,,0,2020-02-02,2020-02-24,,released
14,female,1980,China,capital area,,contact with patient,3,12,3,2020-02-02,2020-02-18,,released
15,male,1977,Korea,capital area,,contact with patient,2,4,15,2020-02-02,2020-02-24,,released
16,female,1977,Korea,Gwangju,,visit to Thailand,1,,450,2020-02-04,2020-02-19,,released
17,male,1982,Korea,capital area,,contact with patient in Singapore,2,,290,2020-02-05,2020-02-12,,released
18,female,1999,Korea,Gwangju,,contact with patient,2,16,8,2020-02-05,2020-02-19,,released
19,male,1983,Korea,capital area,,contact with patient in Singapore,2,,68,2020-02-05,2020-02-21,,released
20,female,1978,Korea,capital area,,contact with patient,3,15,2,2020-02-05,2020-02-24,,released
21,female,1960,Korea,capital area,,contact with patient,3,6,6,2020-02-05,2020-02-29,,released
22,male,1973,Korea,Gwangju,,contact with patient,2,16,1,2020-02-06,2020-02-15,,released
23,female,1962,China,capital area,,visit to Wuhan,1,,23,2020-02-06,2020-02-29,,released
24,male,1992,Korea,filtered at airport,,residence in Wuhan,1,,0,2020-02-06,2020-02-27,,released
25,female,1946,Korea,capital area,,contact with patient,2,27,12,2020-02-09,,,isolated
26,male,1968,Korea,capital area,,contact with patient,1,27,0,2020-02-09,,,isolated
27,female,1982,China,capital area,,visit to China,1,,40,2020-02-09,,,isolated
28,female,1989,China,capital area,,contact with patient,2,3,1,2020-02-10,2020-02-17,,released
29,male,1938,Korea,capital area,,contact with patient,4,83,117,2020-02-16,,,isolated
30,female,1952,Korea,capital area,,contact with patient,5,29,27,2020-02-16,,,isolated
31,female,1959,Korea,Daegu,Shincheonji Church,,,,1160,2020-02-18,,,isolated
32,female,2009,Korea,capital area,,contact with patient,,20,,2020-02-18,2020-03-04,,released
33,female,1980,Korea,Daegu,,contact with patient,,31,,2020-02-18,,,isolated
34,male,1996,Korea,Daegu,Shincheonji Church,,,,,2020-02-18,,,isolated
35,female,1994,Korea,Daegu,Shincheonji Church,,,,,2020-02-18,,,isolated
36,female,1972,Korea,Daegu,Shincheonji Church,,,,,2020-02-18,,,isolated
37,male,1973,Korea,Gyeongsangbuk-do,,,,,,2020-02-18,2020-02-26,,released
38,female,1963,Korea,Daegu,,,,,,2020-02-18,,2020-02-23,deceased
39,female,1959,Korea,Gyeongsangbuk-do,Shincheonji Church,,,,,2020-02-18,2020-03-03,,released
40,male,1943,Korea,capital area,,,,,8,2020-02-19,,,isolated
41,female,1951,Korea,Gyeongsangbuk-do,Shincheonji Church,,,,,2020-02-19,,,isolated
42,female,1991,Korea,Daegu,Shincheonji Church,,,,,2020-02-19,,,isolated
43,female,1962,Korea,Daegu,Shincheonji Church,,,,,2020-02-19,,,isolated
44,female,1974,Korea,Daegu,Shincheonji Church,,,,,2020-02-19,,,isolated
45,female,1966,Korea,Daegu,,,,,,2020-02-19,,,isolated
46,male,1992,Korea,Daegu,,,,,,2020-02-19,,,isolated
47,female,1957,Korea,Daegu,Shincheonji Church,contact with patient,,31,,2020-02-19,,,isolated
48,female,1948,Korea,Daegu,Shincheonji Church,contact with patient,,31,,2020-02-19,,,isolated
49,male,1962,Korea,Daegu,Shincheonji Church,contact with patient,,31,,2020-02-19,,,isolated
50,male,1944,Korea,Daegu,Shincheonji Church,contact with patient,,31,,2020-02-19,2020-03-02,,released
51,female,1959,Korea,Daegu,Shincheonji Church,contact with patient,,31,,2020-02-19,2020-02-26,,released
52,male,1996,Korea,,,,,,,2020-02-19,,,isolated
53,female,1982,Korea,Daegu,,,,,,2020-02-19,,,isolated
54,male,1963,Korea,Gyeongsangbuk-do,Cheongdo Daenam Hospital,,,,,2020-02-19,,2020-02-23,deceased
55,male,1961,Korea,Gyeongsangbuk-do,Cheongdo Daenam Hospital,,,,,2020-02-19,,2020-02-23,deceased
56,male,1945,Korea,capital area,,contact with patient,4,83,,2020-02-19,,,isolated
57,male,1990,Korea,Daegu,,,,,,2020-02-19,,,isolated
58,female,1994,Korea,Daegu,,,,,,2020-02-19,,,isolated
59,female,1986,Korea,Daegu,,,,,,2020-02-19,,,isolated
60,female,1961,Korea,Daegu,,,,,,2020-02-19,,,isolated
61,female,1962,Korea,Daegu,,,,,,2020-02-19,,,isolated
62,male,1960,Korea,Daegu,,,,,,2020-02-19,,,isolated
63,female,1968,Korea,Daegu,,,,,,2020-02-20,2020-02-28,,released
64,female,1961,Korea,,,,,,,2020-02-19,,,isolated
65,female,1970,Korea,Daegu,,,,,,2020-02-19,2020-02-27,,released
66,male,1998,Korea,Gyeongsangbuk-do,Shincheonji Church,visit to Daegu,,,,2020-02-19,,,isolated
67,female,1990,Korea,Gyeongsangbuk-do,,,,,,2020-02-20,,,isolated
68,female,1964,Korea,,,,,,,2020-02-20,,,isolated
69,male,1991,Korea,,,,,,,2020-02-20,,,isolated
70,female,1972,Korea,,,,,,,2020-02-20,,,isolated
71,female,1964,Korea,,,,,,,2020-02-20,,,isolated
72,female,1981,Korea,,,,,,,2020-02-20,,,isolated
73,female,2000,Korea,Gyeongsangbuk-do,,,,,,2020-02-20,,,isolated
74,male,1971,Korea,,,,,,,2020-02-20,,,isolated
75,female,1997,Korea,,,,,,,2020-02-20,,,isolated
76,male,1984,Korea,,,,,,,2020-02-20,,,isolated
77,female,1963,Korea,,,,,,,2020-02-20,,,isolated
78,male,1965,Korea,,,,,,,2020-02-20,,,isolated
79,female,1998,Korea,Gyeongsangbuk-do,,,,,,2020-02-20,,,isolated
80,female,1986,Korea,,,,,,,2020-02-20,,,isolated
81,female,1955,Korea,,,,,,,2020-02-20,,,isolated
82,male,1956,Korea,,,,,,,2020-02-20,,,isolated
83,male,1944,Korea,capital area,,contact with patient,3,6,,2020-02-20,2020-03-01,,released
84,male,1951,Korea,Daegu,,,,,,2020-02-20,,,isolated
85,female,1972,Korea,Gyeongsangbuk-do,Shincheonji Church,,,,,2020-02-20,,,isolated
86,male,1989,Korea,Daegu,,,,,,2020-02-20,,,isolated
87,female,1999,Korea,Daegu,,,,,,2020-02-20,,,isolated
88,female,1979,Korea,Daegu,,,,,,2020-02-20,,,isolated
89,female,1996,Korea,Daegu,,,,,,2020-02-20,,,isolated
90,female,1979,Korea,Daegu,,,,,,2020-02-20,,,isolated
91,female,1974,Korea,Gyeongsangbuk-do,Shincheonji Church,visit to Daegu,,,,2020-02-20,,,isolated
92,,,Korea,,,,,,,2020-02-20,,,isolated
93,,,Korea,,,,,,,2020-02-20,,,isolated
94,,,Korea,,,,,,,2020-02-20,,,isolated
95,,,Korea,,,,,,,2020-02-20,,,isolated
96,,,Korea,,,,,,,2020-02-20,,,isolated
97,,,Korea,,,,,,,2020-02-20,,,isolated
98,,,Korea,,,,,,,2020-02-20,,,isolated
99,,,Korea,,,,,,,2020-02-20,,,isolated
100,,,Korea,,,,,,,2020-02-20,,,isolated
101,,,Korea,,,,,,,2020-02-20,,,isolated
102,,,Korea,,,,,,,2020-02-20,,,isolated
103,,,,,,,,,,,,,
104,male,1957,Korea,Gyeongsangbuk-do,Cheongdo Daenam Hospital,,,,,2020-02-20,,2020-02-19,deceased
105,female,1965,Korea,Gyeongsangbuk-do,Shincheonji Church,visit to Daegu,,,,2020-02-21,,,isolated
106,female,1991,Korea,Gyeongsangbuk-do,Shincheonji Church,visit to Daegu,,,,2020-02-21,,,isolated
107,male,1953,Korea,Gyeongsangbuk-do,Cheongdo Daenam Hospital,,,,,2020-02-21,,2020-02-24,deceased
108,,,Korea,,,,,,,2020-02-21,,,isolated
109,,,Korea,,,,,,,2020-02-21,,,isolated
110,,,Korea,,,,,,,2020-02-21,,,isolated
111,male,2000,Korea,capital area,,,,,,2020-02-21,,,isolated
112,female,1941,Korea,capital area,,contact with patient,5,136,,2020-02-21,,,isolated
113,male,1992,Korea,Jeollabuk-do,,visit to Daegu,,,,2020-02-21,,,isolated
114,male,1946,Korea,Daegu,Shincheonji Church,,,,,2020-02-21,,2020-02-26,deceased
115,,,Korea,,,,,,,2020-02-21,,,isolated
116,,,Korea,,,,,,,2020-02-21,,,isolated
117,,,Korea,,,,,,,2020-02-21,,,isolated
118,,,Korea,,,,,,,2020-02-21,,,isolated
119,,,Korea,,,,,,,2020-02-21,,,isolated
120,,,Korea,,,,,,,2020-02-21,,,isolated
121,female,1944,Korea,capital area,,contact with patient,,40,,2020-02-21,,,isolated
122,,,Korea,,,,,,,2020-02-21,,,isolated
123,,,Korea,,,,,,,2020-02-21,,,isolated
124,,,Korea,,,,,,,2020-02-21,,,isolated
125,,,Korea,,,,,,,2020-02-21,,,isolated
126,male,1980,Korea,Gwangju,Shincheonji Church,visit to Daegu,,,65,2020-02-21,,,isolated
127,,,Korea,,,,,,,2020-02-21,,,isolated
128,,,Korea,,,,,,,2020-02-21,,,isolated
129,,,Korea,,,,,,,2020-02-21,,,isolated
130,,,Korea,,,,,,,2020-02-21,,,isolated
131,,,Korea,,,,,,,2020-02-21,,,isolated
132,,,Korea,,,,,,,2020-02-21,,,isolated
133,,,Korea,,,,,,,2020-02-21,,,isolated
134,,,Korea,,,,,,,2020-02-21,,,isolated
135,,,Korea,,,,,,,2020-02-21,,,isolated
136,male,1936,Korea,capital area,,contact with patient,5,56,,2020-02-21,,,isolated
137,,,Korea,,,,,,,2020-02-21,,,isolated
138,,,Korea,,,,,,,2020-02-21,,,isolated
139,male,1998,Korea,Jeju-do,,visit to Daegu,,,,2020-02-21,,,isolated
140,female,1988,Korea,Daegu,,contact with patient,,31,,2020-02-21,,,isolated
141,,,Korea,,,,,,,2020-02-21,,,isolated
142,,,Korea,,,,,,,2020-02-21,,,isolated
143,,,Korea,,,,,,,2020-02-21,,,isolated
144,,,Korea,,,,,,,2020-02-21,,,isolated
145,,,Korea,,,,,,,2020-02-21,,,isolated
146,,,Korea,,,,,,,2020-02-21,,,isolated
147,,,Korea,,,,,,,2020-02-21,,,isolated
148,,,Korea,,,,,,,2020-02-21,,,isolated
149,,,Korea,,,,,,,2020-02-21,,,isolated
150,,,Korea,,,,,,,2020-02-21,,,isolated
151,,,Korea,,,,,,,2020-02-21,,,isolated
152,,,Korea,,,,,,,2020-02-21,,,isolated
153,,,Korea,,,,,,,2020-02-21,,,isolated
154,,,Korea,,,,,,,2020-02-21,,,isolated
155,,,Korea,,,,,,,2020-02-21,,,isolated
156,,,Korea,,,,,,,2020-02-21,,,isolated
157,,,Korea,,,,,,,2020-02-21,,,isolated
158,,,Korea,,,,,,,2020-02-21,,,isolated
159,,,Korea,,,,,,,2020-02-21,,,isolated
160,,,Korea,,,,,,,2020-02-21,,,isolated
161,male,1985,Korea,capital area,Eunpyeong St. Mary's Hospital,,,,,2020-02-21,,,isolated
162,male,1987,Korea,Daegu,,contact with patient,,31,,2020-02-21,,,isolated
163,,,Korea,,,,,,,2020-02-21,,,isolated
164,male,1989,Korea,Gwangju,Shincheonji Church,contact with patient,,126,,2020-02-21,,,isolated
165,,,Korea,,,,,,,2020-02-21,,,isolated
166,,,Korea,,,,,,,2020-02-21,,,isolated
167,,,Korea,,,,,,,2020-02-21,,,isolated
168,,,Korea,,,,,,,2020-02-21,,,isolated
169,,,Korea,,,,,,,2020-02-21,,,isolated
170,,,Korea,,,,,,,2020-02-21,,,isolated
171,,,Korea,,,,,,,2020-02-21,,,isolated
172,,,Korea,,,,,,,2020-02-21,,,isolated
173,,,Korea,,,,,,,2020-02-21,,,isolated
174,,,Korea,,,,,,,2020-02-21,,,isolated
175,,,Korea,,,,,,,2020-02-21,,,isolated
176,,,Korea,,,,,,,2020-02-21,,,isolated
177,,,Korea,,,,,,,2020-02-21,,,isolated
178,,,Korea,,,,,,,2020-02-21,,,isolated
179,,,Korea,,,,,,,2020-02-21,,,isolated
180,,,Korea,,,,,,,2020-02-21,,,isolated
181,,,Korea,,,,,,,2020-02-21,,,isolated
182,,,Korea,,,,,,,2020-02-21,,,isolated
183,,,Korea,,,,,,,2020-02-21,,,isolated
184,,,Korea,,,,,,,2020-02-21,,,isolated
185,,,Korea,,,,,,,2020-02-21,,,isolated
186,,,Korea,,,,,,,2020-02-21,,,isolated
187,,,Korea,,,,,,,2020-02-21,,,isolated
188,male,1961,Korea,capital area,Shincheonji Church,visit to Daegu,,,,2020-02-21,,,isolated
189,,,Korea,,,,,,,2020-02-21,,,isolated
190,,,Korea,,,,,,,2020-02-21,,,isolated
191,,,Korea,,,,,,,2020-02-21,,,isolated
192,,,Korea,,,,,,,2020-02-21,,,isolated
193,,,Korea,,,,,,,2020-02-21,,,isolated
194,,,Korea,,,,,,,2020-02-21,,,isolated
195,,,Korea,,,,,,,2020-02-21,,,isolated
196,,,Korea,,,,,,,2020-02-21,,,isolated
197,,,Korea,,,,,,,2020-02-21,,,isolated
198,,,Korea,,,,,,,2020-02-21,,,isolated
199,,,Korea,,,,,,,2020-02-21,,,isolated
200,male,2001,Korea,Busan,Onchun Church,,,,,2020-02-21,,,isolated
201,,,Korea,,,,,,,2020-02-21,,,isolated
202,,,Korea,,,,,,,2020-02-21,,,isolated
203,,,Korea,,,,,,,2020-02-21,,,isolated
204,,,Korea,,,,,,,2020-02-21,,,isolated
205,female,1965,Korea,Gyeongsangbuk-do,Cheongdo Daenam Hospital,,,,,2020-02-22,,2020-02-21,deceased
206,,,Korea,,,,,,,2020-02-22,,,isolated
207,female,,Korea,Gyeongsangbuk-do,Shincheonji Church,visit to Daegu,,,,2020-02-22,,,isolated
208,,,Korea,,,,,,,2020-02-22,,,isolated
209,,,Korea,,,,,,,2020-02-22,,,isolated
210,male,1985,Korea,Gwangju,Shincheonji Church,visit to Daegu,,,30,2020-02-22,,,isolated
211,female,1974,Korea,Gyeongsangbuk-do,,,,,,2020-02-22,,,isolated
212,,,Korea,,,,,,,2020-02-22,,,isolated
213,,,Korea,,,,,,,2020-02-22,,,isolated
214,,,Korea,,,,,,,2020-02-22,,,isolated
215,,,Korea,,,,,,,2020-02-22,,,isolated
216,,,Korea,,,,,,,2020-02-22,,,isolated
217,,,Korea,,,,,,,2020-02-22,,,isolated
218,,,Korea,,,,,,,2020-02-22,,,isolated
219,,,Korea,,,,,,,2020-02-22,,,isolated
220,,,Korea,,,,,,,2020-02-22,,,isolated
221,,,Korea,,,,,,,2020-02-22,,,isolated
222,female,1998,Korea,Jeju-do,,visit to Daegu,,,,2020-02-22,,,isolated
223,,,Korea,,,,,,,2020-02-22,,,isolated
224,,,Korea,,,,,,,2020-02-22,,,isolated
225,,,Korea,,,,,,,2020-02-22,,,isolated
226,,,Korea,,,,,,,2020-02-22,,,isolated
227,,,Korea,,,,,,,2020-02-22,,,isolated
228,,,Korea,,,,,,,2020-02-22,,,isolated
229,,,Korea,,,,,,,2020-02-22,,,isolated
230,male,1984,Korea,Jeollabuk-do,,contact with patient,,113,,2020-02-22,,,isolated
231,female,1963,Korea,Busan,,,,,,2020-02-22,,,isolated
232,,,Korea,,,,,,,2020-02-22,,,isolated
233,,,Korea,,,,,,,2020-02-22,,,isolated
234,female,1974,Korea,Gyeongsangbuk-do,Shincheonji Church,visit to Daegu,,,,2020-02-22,,,isolated
235,male,1968,Korea,Gyeongsangbuk-do,,,,,,2020-02-22,,,isolated
236,male,1983,Korea,Gyeongsangbuk-do,,,,,,2020-02-22,,,isolated
237,female,2000,Korea,Gyeongsangbuk-do,Shincheonji Church,visit to Daegu,,,,2020-02-22,,,isolated
238,male,1966,Korea,Gyeongsangbuk-do,,,,,,2020-02-22,,,isolated
239,male,1985,Korea,Gwangju,Shincheonji Church,visit to Daegu,,,14,2020-02-22,,,isolated
240,female,1978,Korea,Gyeongsangbuk-do,Shincheonji Church,visit to Daegu,,,,2020-02-22,,,isolated
241,female,1997,Korea,Daejeon,,visit to Daegu,,,23,2020-02-22,,,isolated
242,female,1965,Korea,Gyeongsangbuk-do,Shincheonji Church,visit to Daegu,,,,2020-02-22,,,isolated
243,,,Korea,,,,,,,2020-02-22,,,isolated
244,female,1946,Korea,Gyeongsangbuk-do,Shincheonji Church,visit to Daegu,,,,2020-02-22,,,isolated
245,,,Korea,,,,,,,2020-02-22,,,isolated
246,female,1982,Korea,capital area,Shincheonji Church,visit to Daegu,,,,2020-02-22,,,isolated
247,,,Korea,,,,,,,2020-02-22,,,isolated
248,,,Korea,,,,,,,2020-02-22,,,isolated
249,,,Korea,,,,,,,2020-02-22,,,isolated
250,,,Korea,,,,,,,2020-02-22,,,isolated
251,,,Korea,,,,,,,2020-02-22,,,isolated
252,,,Korea,,,,,,,2020-02-22,,,isolated
253,,,Korea,,,,,,,2020-02-22,,,isolated
254,,,Korea,,,,,,,2020-02-22,,,isolated
255,,,Korea,,,,,,,2020-02-22,,,isolated
256,,,Korea,,,,,,,2020-02-22,,,isolated
257,,,Korea,,,,,,,2020-02-22,,,isolated
258,,,Korea,,,,,,,2020-02-22,,,isolated
259,,,Korea,,,,,,,2020-02-22,,,isolated
260,,,Korea,,,,,,,2020-02-22,,,isolated
261,,,Korea,,,,,,,2020-02-22,,,isolated
262,,,Korea,,,,,,,2020-02-22,,,isolated
263,,,Korea,,,,,,,2020-02-22,,,isolated
264,,,Korea,,,,,,,2020-02-22,,,isolated
265,,,Korea,,,,,,,2020-02-22,,,isolated
266,,,Korea,,,,,,,2020-02-22,,,isolated
267,,,Korea,,,,,,,2020-02-22,,,isolated
268,,,Korea,,,,,,,2020-02-22,,,isolated
269,,,Korea,,,,,,,2020-02-22,,,isolated
270,,,Korea,,,,,,,2020-02-22,,,isolated
271,,,Korea,,,,,,,2020-02-22,,,isolated
272,,,Korea,,,,,,,2020-02-22,,,isolated
273,,,Korea,,,,,,,2020-02-22,,,isolated
274,,,Korea,,,,,,,2020-02-22,,,isolated
275,,,Korea,,,,,,,2020-02-22,,,isolated
276,,,Korea,,,,,,,2020-02-22,,,isolated
277,,,Korea,,,,,,,2020-02-22,,,isolated
278,,,Korea,,,,,,,2020-02-22,,,isolated
279,,,Korea,,,,,,,2020-02-22,,,isolated
280,,,Korea,,,,,,,2020-02-22,,,isolated
281,,,Korea,,,,,,,2020-02-22,,,isolated
282,,,Korea,,,,,,,2020-02-22,,,isolated
283,,,Korea,,,,,,,2020-02-22,,,isolated
284,,,Korea,,,,,,,2020-02-22,,,isolated
285,,,Korea,,,,,,,2020-02-22,,,isolated
286,male,1958,Korea,Gyeongsangbuk-do,Cheongdo Daenam Hospital,,,,,2020-02-22,,2020-02-23,deceased
287,,,Korea,,,,,,,2020-02-22,,,isolated
288,,,Korea,,,,,,,2020-02-22,,,isolated
289,,,Korea,,,,,,,2020-02-22,,,isolated
290,,,Korea,,,,,,,2020-02-22,,,isolated
291,,,Korea,,,,,,,2020-02-22,,,isolated
292,,,Korea,,,,,,,2020-02-22,,,isolated
293,,,Korea,,,,,,,2020-02-22,,,isolated
294,,,Korea,,,,,,,2020-02-22,,,isolated
295,,,Korea,,,,,,,2020-02-22,,,isolated
296,,,Korea,,,,,,,2020-02-22,,,isolated
297,,,Korea,,,,,,,2020-02-22,,,isolated
298,male,1962,Korea,Gyeongsangbuk-do,Cheongdo Daenam Hospital,,,,,2020-02-22,,2020-02-25,deceased
299,,,Korea,,,,,,,2020-02-22,,,isolated
300,,,Korea,,,,,,,2020-02-22,,,isolated
301,,,Korea,,,,,,,2020-02-22,,,isolated
302,,,Korea,,,,,,,2020-02-22,,,isolated
303,,,Korea,,,,,,,2020-02-22,,,isolated
304,,,Korea,,,,,,,2020-02-22,,,isolated
305,,,Korea,,,,,,,2020-02-22,,,isolated
306,,,Korea,,,,,,,2020-02-22,,,isolated
307,,,Korea,,,,,,,2020-02-22,,,isolated
308,,,Korea,,,,,,,2020-02-22,,,isolated
309,,,Korea,,,,,,,2020-02-22,,,isolated
310,,,Korea,,,,,,,2020-02-22,,,isolated
311,,,Korea,,,,,,,2020-02-22,,,isolated
312,,,Korea,,,,,,,2020-02-22,,,isolated
313,,,Korea,,,,,,,2020-02-22,,,isolated
314,,,Korea,,,,,,,2020-02-22,,,isolated
315,,,Korea,,,,,,,2020-02-22,,,isolated
316,,,Korea,,,,,,,2020-02-22,,,isolated
317,,,Korea,,,,,,,2020-02-22,,,isolated
318,,,Korea,,,,,,,2020-02-22,,,isolated
319,,,Korea,,,,,,,2020-02-22,,,isolated
320,,,Korea,,,,,,,2020-02-22,,,isolated
321,,,Korea,,,,,,,2020-02-22,,,isolated
322,,,Korea,,,,,,,2020-02-22,,,isolated
323,,,Korea,,,,,,,2020-02-22,,,isolated
324,,,Korea,,,,,,,2020-02-22,,,isolated
325,,,Korea,,,,,,,2020-02-22,,,isolated
326,,,Korea,,,,,,,2020-02-22,,,isolated
327,,,Korea,,,,,,,2020-02-22,,,isolated
328,,,Korea,,,,,,,2020-02-22,,,isolated
329,,,Korea,,,,,,,2020-02-22,,,isolated
330,,,Korea,,,,,,,2020-02-22,,,isolated
331,,,Korea,,,,,,,2020-02-22,,,isolated
332,,,Korea,,,,,,,2020-02-22,,,isolated
333,,,Korea,,,,,,,2020-02-22,,,isolated
334,,,Korea,,,,,,,2020-02-22,,,isolated
335,male,1955,Korea,Gyeongsangbuk-do,,,,,,2020-02-22,,,isolated
336,,,Korea,,,,,,,2020-02-22,,,isolated
337,,,Korea,,,,,,,2020-02-22,,,isolated
338,,,Korea,,,,,,,2020-02-22,,,isolated
339,,,Korea,,,,,,,2020-02-22,,,isolated
340,,,Korea,,,,,,,2020-02-22,,,isolated
341,,,Korea,,,,,,,2020-02-22,,,isolated
342,female,1943,Korea,Gyeongsangbuk-do,Cheongdo Daenam Hospital,,,,,2020-02-22,,,isolated
343,female,1975,Korea,Gyeongsangbuk-do,Cheongdo Daenam Hospital,,,,,2020-02-22,,,isolated
344,male,1984,Korea,Chungcheongbuk-do,,contact with patient,,230,,2020-02-22,,,isolated
345,female,1985,Korea,Chungcheongbuk-do,,contact with patient,,230,,2020-02-22,,,isolated
346,male,,Korea,Chungcheongnam-do,,,,,,2020-02-22,,,isolated
347,male,1996,Korea,capital area,,,,,,2020-02-22,,,isolated
348,male,1980,Korea,capital area,Pilgrimage,pilgrimage to Israel,,,,2020-02-22,,,isolated
349,,,Korea,,,,,,,2020-02-22,,,isolated
350,,,Korea,,,,,,,2020-02-22,,,isolated
351,,,Korea,,,,,,,2020-02-22,,,isolated
352,,,Korea,,,,,,,2020-02-22,,,isolated
353,,,Korea,,,,,,,2020-02-22,,,isolated
354,,,Korea,,,,,,,2020-02-22,,,isolated
355,,,Korea,,,,,,,2020-02-22,,,isolated
356,,,Korea,,,,,,,2020-02-22,,,isolated
357,,,Korea,,,,,,,2020-02-22,,,isolated
358,,,Korea,,,,,,,2020-02-22,,,isolated
359,,,Korea,,,,,,,2020-02-22,,,isolated
360,male,1959,Korea,capital area,,,,,,2020-02-22,,,isolated
361,male,1999,Korea,capital area,,visit to Daegu,,,,2020-02-22,,,isolated
362,male,1956,Korea,capital area,,contact with patient,6,30,,2020-02-22,,,isolated
363,female,1993,Korea,Ulsan,Shincheonji Church,visit to Daegu,,,,2020-02-22,,,isolated
364,,,Korea,,,,,,,2020-02-22,,,isolated
365,male,1958,Korea,capital area,Eunpyeong St. Mary's Hospital,contact with patient,,161,,2020-02-22,,,isolated
366,male,1999,Korea,Gangwon-do,,visit to Daegu,,,,2020-02-22,,,isolated
367,,,Korea,,,,,,,2020-02-22,,,isolated
368,,,Korea,,,,,,,2020-02-22,,,isolated
369,,,Korea,,,,,,,2020-02-22,,,isolated
370,,,Korea,,,,,,,2020-02-22,,,isolated
371,,,Korea,,,,,,,2020-02-22,,,isolated
372,female,1955,Korea,Daejeon,,,,,9,2020-02-22,,,isolated
373,female,,Korea,Gangwon-do,Shincheonji Church,visit to Daegu,,,,2020-02-22,,,isolated
374,female,,Korea,Gangwon-do,Shincheonji Church,visit to Daegu,,,,2020-02-22,,,isolated
375,,,Korea,,,,,,,2020-02-22,,,isolated
376,,,Korea,,,,,,,2020-02-22,,,isolated
377,,,Korea,,,,,,,2020-02-22,,,isolated
378,,,Korea,,,,,,,2020-02-22,,,isolated
379,,,Korea,,,,,,,2020-02-22,,,isolated
380,,,Korea,,,,,,,2020-02-22,,,isolated
381,,,Korea,,,,,,,2020-02-22,,,isolated
382,,,Korea,,,,,,,2020-02-22,,,isolated
383,,,Korea,,,,,,,2020-02-22,,,isolated
384,male,1995,Korea,Gyeongsangbuk-do,,visit to Daegu,,,,2020-02-22,,,isolated
385,male,1956,Korea,Gyeongsangbuk-do,Pilgrimage,pilgrimage to Israel,,,,2020-02-22,,,isolated
386,male,1956,Korea,Gyeongsangbuk-do,Pilgrimage,pilgrimage to Israel,,,,2020-02-22,,,isolated
387,female,1960,Korea,Gyeongsangbuk-do,Pilgrimage,pilgrimage to Israel,,,,2020-02-22,,,isolated
388,female,1960,Korea,Gyeongsangbuk-do,Pilgrimage,pilgrimage to Israel,,,,2020-02-22,,,isolated
389,,,Korea,,,,,,,2020-02-22,,,isolated
390,,,Korea,,,,,,,2020-02-22,,,isolated
391,,,Korea,,,,,,,2020-02-22,,,isolated
392,male,1966,Korea,capital area,Shincheonji Church,,,,,2020-02-22,,,isolated
393,,,Korea,,,,,,,2020-02-22,,,isolated
394,male,1987,Korea,Gyeongsangbuk-do,,,,,,2020-02-22,,,isolated
395,female,1977,Korea,Gyeongsangbuk-do,,,,,,2020-02-22,,,isolated
396,female,1996,Korea,Gyeongsangbuk-do,,,,,,2020-02-22,,,isolated
397,female,,Korea,Gangwon-do,,visit to Daegu,,,,2020-02-22,,,isolated
398,female,1960,Korea,capital area,Shincheonji Church,visit to Daegu,,,,2020-02-22,,,isolated
399,,,Korea,,,,,,,2020-02-22,,,isolated
400,,,Korea,,,,,,,2020-02-22,,,isolated
401,,,Korea,,,,,,,2020-02-22,,,isolated
402,,,Korea,,,,,,,2020-02-22,,,isolated
403,,,Korea,,,,,,,2020-02-22,,,isolated
404,,,Korea,,,,,,,2020-02-22,,,isolated
405,,,Korea,,,,,,,2020-02-22,,,isolated
406,,,Korea,,,,,,,2020-02-22,,,isolated
407,,,Korea,,,,,,,2020-02-22,,,isolated
408,,,Korea,,,,,,,2020-02-22,,,isolated
409,,,Korea,,,,,,,2020-02-22,,,isolated
410,,,Korea,,,,,,,2020-02-22,,,isolated
411,,,Korea,,,,,,,2020-02-22,,,isolated
412,,,Korea,,,,,,,2020-02-22,,,isolated
413,,,Korea,,,,,,,2020-02-22,,,isolated
414,,,Korea,,,,,,,2020-02-22,,,isolated
415,,,Korea,,,,,,,2020-02-22,,,isolated
416,,,Korea,,,,,,,2020-02-22,,,isolated
417,,,Korea,,,,,,,2020-02-22,,,isolated
418,,,Korea,,,,,,,2020-02-22,,,isolated
419,male,,Korea,Gangwon-do,,,,,,2020-02-22,,,isolated
420,male,1986,Korea,Daegu,,visit to Daegu,,,,2020-02-22,,,isolated
421,,,Korea,,,,,,,2020-02-22,,,isolated
422,,,Korea,,,,,,,2020-02-22,,,isolated
423,,,Korea,,,,,,,2020-02-22,,,isolated
424,,,Korea,,,,,,,2020-02-22,,,isolated
425,,,Korea,,,,,,,2020-02-22,,,isolated
426,,,Korea,,,,,,,2020-02-22,,,isolated
427,,,Korea,,,,,,,2020-02-22,,,isolated
428,,,Korea,,,,,,,2020-02-22,,,isolated
429,,,Korea,,,,,,,2020-02-22,,,isolated
430,,,Korea,,,,,,,2020-02-22,,,isolated
431,,,Korea,,,,,,,2020-02-22,,,isolated
432,,,Korea,,,,,,,2020-02-22,,,isolated
433,female,1954,Korea,capital area,,,,,,2020-02-22,,,isolated
434,,,Korea,,,,,,,2020-02-23,,,isolated
435,,,Korea,,,,,,,2020-02-23,,,isolated
436,,,Korea,,,,,,,2020-02-23,,,isolated